[rsbac] kernel 2.4.30 and rsbac 1.2.4 with bf 1-3

gabor.horvath@konicaminolta.hu gabor.horvath at konicaminolta.hu
Mon Apr 11 16:07:46 CEST 2005

Dear members,

I have just tried to compile the above rsbac version on a vanilla, clean 
2.4.30  kernel without success. If I switch RSBAC option on the 
compilation fails. Without it everything is OK. It is a stable debian. 
Older versions (2.4.28 with 1.2.3) works and compiles like a charm.
Any clue?

Thanks in advance !

gcc -D__KERNEL__ -I/usr/src/linux-2.4.30/include -Wall -Wstrict-prototypes 
-Wno-trigraphs -O2 -fno-strict-aliasing -fno-common -fomit-frame-pointer 
-pipe -mpreferred-stack-boundary=2 -march=i386    -nostdinc -iwithprefix 
include -DKBUILD_BASENAME=base  -c -o base.o base.c
base.c: In function `maps_open':
base.c:459: parse error before `int'
base.c:460: `ret' undeclared (first use in this function)
base.c:460: (Each undeclared identifier is reported only once
base.c:460: for each function it appears in.)
base.c:465: warning: control reaches end of non-void function
base.c: In function `mounts_open':
base.c:504: parse error before `int'
base.c:506: `ret' undeclared (first use in this function)
base.c:523: warning: control reaches end of non-void function
make[3]: *** [base.o] Error 1
make[3]: Leaving directory `/usr/src/linux-2.4.30/fs/proc'
make[2]: *** [first_rule] Error 2
make[2]: Leaving directory `/usr/src/linux-2.4.30/fs/proc'
make[1]: *** [_subdir_proc] Error 2
make[1]: Leaving directory `/usr/src/linux-2.4.30/fs'
make: *** [_dir_fs] Error 2

Gabor Horvath
gabor.horvath at konicaminolta.hu

More information about the rsbac mailing list