[rsbac] (pre) 1.3.3 compilations warnings and bugs

Arnaud Patard apatard at mandriva.com
Thu May 3 20:36:51 CEST 2007


Tomasz Kłoczko <kloczek at zie.pg.gda.pl> writes:

> rsbac/data_structures/aci_data_structures.c:7847: error: implicit
> declaration of function 'try_to_freeze'
> rsbac/data_structures/aci_data_structures.c: In function 'rsbac_init':
> rsbac/data_structures/aci_data_structures.c:7989: warning: comparison of
> unsigned expression < 0 is always false
> make[2]: *** [rsbac/data_structures/aci_data_structures.o] Error 1
> make[1]: *** [rsbac/data_structures] Error 2
> make: *** [rsbac] Error 2

hmmm... You built with CONFIG_SOFTWARE_SUSPEND enabled, right ?

If so, try the appended patch. I didn't try to build it but it should do
the trick.


-------------- next part --------------
A non-text attachment was scrubbed...
Name: freeze_buildfix.patch
Type: text/x-patch
Size: 1343 bytes
Desc: not available
Url : http://www.rsbac.org/pipermail/rsbac/attachments/20070503/e3f28885/attachment.bin 

More information about the rsbac mailing list